BDBM50189881 CHEMBL3827632
SMILES OC(=O)c1cc(Cl)ccc1-c1ccc(Cl)cc1C(=O)Nc1ccc-2c(Cc3cc(Cl)cc(Cl)c-23)c1
InChI Key InChIKey=GZDLWFSZTBRVDP-UHFFFAOYSA-N
Data  1 IC50
  Tab Delimited (TSV)   2D SDfile   Computed 3D by Vconf -m prep SDfile
Find this compound or compounds like it in BindingDB:
Activity Spreadsheet -- Enzyme Inhibition Constant Data from BindingDB
Found 1 hit for monomerid = 50189881
TargetBotulinum neurotoxin type E(Clostridium botulinum)
Brookhaven National Laboratory
Curated by ChEMBL
LigandPNGBDBM50189881(CHEMBL3827632)
Affinity DataIC50:  3.00E+3nM. Assay description: Inhibition of endopeptidase activity of Clostridium botulinum BoNT/E light chain using SNAP-25 as substrate after 15 mins by HPLC analysis
In DepthDetails ArticlePubMed