BDBM50190609 (2S,4R,5R)-5-(4-methoxybenzylamino)-2-benzhydryl-tetrahydro-2H-pyran-4-ol::CHEMBL211484
SMILES COc1ccc(CN[C@@H]2CO[C@@H](C[C@H]2O)C(c2ccccc2)c2ccccc2)cc1
InChI Key InChIKey=KRIXHIHYAWAVJT-SDHSZQHLSA-N
Data  6 KI
  Tab Delimited (TSV)   2D SDfile   Computed 3D by Vconf -m prep SDfile
Find this compound or compounds like it in BindingDB:
Activity Spreadsheet -- Enzyme Inhibition Constant Data from BindingDB
Found 6 hits for monomerid = 50190609
TargetSodium-dependent serotonin transporter(Rattus norvegicus (rat))
Wayne State University
Curated by ChEMBL
LigandPNGBDBM50190609((2S,4R,5R)-5-(4-methoxybenzylamino)-2-benzhydryl-t...)
Affinity DataKi:  14.7nM. Assay description: Inhibition of SERT in rat cerebral cortex assessed as [3H]serotonin accumulation
In DepthDetails ArticlePubMed
TargetTransporter(Rattus norvegicus)
Wayne State University
Curated by ChEMBL
LigandPNGBDBM50190609((2S,4R,5R)-5-(4-methoxybenzylamino)-2-benzhydryl-t...)
Affinity DataKi:  16nM. Assay description: Inhibition of NET-mediated [3H]NE uptake in rat cerebral cortex
In DepthDetails ArticlePubMed
TargetSodium-dependent serotonin transporter(Rattus norvegicus (rat))
Wayne State University
Curated by ChEMBL
LigandPNGBDBM50190609((2S,4R,5R)-5-(4-methoxybenzylamino)-2-benzhydryl-t...)
Affinity DataKi:  26nM. Assay description: Inhibition of SERT-mediated [3H]5HT uptake in rat cerebral cortex
In DepthDetails ArticlePubMed
TargetSodium-dependent dopamine transporter(Rattus norvegicus (rat))
Wayne State University
Curated by ChEMBL
LigandPNGBDBM50190609((2S,4R,5R)-5-(4-methoxybenzylamino)-2-benzhydryl-t...)
Affinity DataKi:  37.4nM. Assay description: Inhibition of DAT in rat striatum assessed as [3H]dopamine accumulation
In DepthDetails ArticlePubMed
TargetSodium-dependent dopamine transporter(Rattus norvegicus (rat))
Wayne State University
Curated by ChEMBL
LigandPNGBDBM50190609((2S,4R,5R)-5-(4-methoxybenzylamino)-2-benzhydryl-t...)
Affinity DataKi:  115nM. Assay description: Inhibition of DAT-mediated [3H]DA uptake in rat striatum
In DepthDetails ArticlePubMed
TargetSodium-dependent dopamine transporter(Rattus norvegicus (rat))
Wayne State University
Curated by ChEMBL
LigandPNGBDBM50190609((2S,4R,5R)-5-(4-methoxybenzylamino)-2-benzhydryl-t...)
Affinity DataKi:  183nM. Assay description: Inhibition of [3H]WIN 35428 binding to rat striatum DAT
In DepthDetails ArticlePubMed