BDBM50190950 6-(4-isopropylphenethyl)-6-cyclopentyl-dihydro-3H-pyran-2,4-dione::CHEMBL214576
SMILES CC(C)c1ccc(CCC2(CC(=O)CC(=O)O2)C2CCCC2)cc1
InChI Key InChIKey=KGJJXYKXFVQFOX-UHFFFAOYSA-N
Data  1 IC50
  Tab Delimited (TSV)   2D SDfile   Computed 3D by Vconf -m prep SDfile
Find this compound or compounds like it in BindingDB:
Activity Spreadsheet -- Enzyme Inhibition Constant Data from BindingDB
Found 1 hit for monomerid = 50190950
TargetRNA-directed RNA polymerase(Hepatitis C virus)
Pfizer
Curated by ChEMBL
LigandPNGBDBM50190950(6-(4-isopropylphenethyl)-6-cyclopentyl-dihydro-3H-...)
Affinity DataIC50:  4.30E+3nM. Assay description: Inhibitory activity against HCV 1b BK NS5B deltaC21 RNA polymerase
In DepthDetails ArticlePubMed