BDBM50190956 6-(3-chloro-4-methoxyphenethyl)-6-cyclopentyl-4-hydroxy-3-(1-methyl-1H-tetrazol-5-ylthio)-5,6-dihydropyran-2-one::CHEMBL214781
SMILES COc1ccc(CCC2(CC(=O)C(Sc3nnnn3C)C(=O)O2)C2CCCC2)cc1Cl
InChI Key InChIKey=IGUUNGRBJZTGJP-UHFFFAOYSA-N
Data  1 IC50
  Tab Delimited (TSV)   2D SDfile   Computed 3D by Vconf -m prep SDfile
Find this compound or compounds like it in BindingDB:
Activity Spreadsheet -- Enzyme Inhibition Constant Data from BindingDB
Found 1 hit for monomerid = 50190956
TargetRNA-directed RNA polymerase(Hepatitis C virus)
Pfizer
Curated by ChEMBL
LigandPNGBDBM50190956(6-(3-chloro-4-methoxyphenethyl)-6-cyclopentyl-4-hy...)
Affinity DataIC50:  280nM. Assay description: Inhibitory activity against HCV 1b BK NS5B deltaC21 RNA polymerase
In DepthDetails ArticlePubMed