BDBM50190967 6-(3-chloro-4-methoxyphenethyl)-6-cyclopentyl-4-hydroxy-3-(4-hydroxyphenylthio)-5,6-dihydropyran-2-one::CHEMBL216044
SMILES COc1ccc(CCC2(CC(=O)C(Sc3ccc(O)cc3)C(=O)O2)C2CCCC2)cc1Cl
InChI Key InChIKey=OVWCGBWGBZGKCI-UHFFFAOYSA-N
Data  1 IC50
  Tab Delimited (TSV)   2D SDfile   Computed 3D by Vconf -m prep SDfile
Find this compound or compounds like it in BindingDB:
Activity Spreadsheet -- Enzyme Inhibition Constant Data from BindingDB
Found 1 hit for monomerid = 50190967
TargetRNA-directed RNA polymerase(Hepatitis C virus)
Pfizer
Curated by ChEMBL
LigandPNGBDBM50190967(6-(3-chloro-4-methoxyphenethyl)-6-cyclopentyl-4-hy...)
Affinity DataIC50:  130nM. Assay description: Inhibitory activity against HCV 1b BK NS5B deltaC21 RNA polymerase
In DepthDetails ArticlePubMed