BDBM50191384 (5R),(6E)-6-(5,6-dihydro-8H-imidazo[2,1-c][1,4]thiazin-2-ylmethylene)-7-oxo-4-thia-1-azabicyclo[3.2.0]hept-2-ene-2-carboxylic acid sodium salt::CHEMBL211889
SMILES [O-]C(=O)C1=CS[C@H]2N1C(=O)\C2=C/c1cn2CCSCc2n1
InChI Key InChIKey=UAILHDKDBBFHDN-STWLFGJUSA-M
Data  4 IC50
  Tab Delimited (TSV)   2D SDfile   Computed 3D by Vconf -m prep SDfile
Find this compound or compounds like it in BindingDB:
Activity Spreadsheet -- Enzyme Inhibition Constant Data from BindingDB
Found 4 hits for monomerid = 50191384
TargetMetallo-beta-lactamase type 2(Bacteroides fragilis)
Wyeth Research
Curated by ChEMBL
LigandPNGBDBM50191384((5R),(6E)-6-(5,6-dihydro-8H-imidazo[2,1-c][1,4]thi...)
Affinity DataIC50:  110nM. Assay description: Inhibition of Bacteroides fragilis CcrA
In DepthDetails ArticlePubMed
TargetBeta-lactamase TEM(Escherichia coli)
Wyeth Research
Curated by ChEMBL
LigandPNGBDBM50191384((5R),(6E)-6-(5,6-dihydro-8H-imidazo[2,1-c][1,4]thi...)
Affinity DataIC50:  730nM. Assay description: Inhibition of Escherichia coli TEM1
In DepthDetails ArticlePubMed
TargetBeta-lactamase(Enterobacter cloacae)
Wyeth Research
Curated by ChEMBL
LigandPNGBDBM50191384((5R),(6E)-6-(5,6-dihydro-8H-imidazo[2,1-c][1,4]thi...)
Affinity DataIC50:  420nM. Assay description: Inhibition of Enterobacter cloacae AmpC
In DepthDetails ArticlePubMed
TargetImipenem-hydrolyzing beta-lactamase(Enterobacter cloacae)
Wyeth Research
Curated by ChEMBL
LigandPNGBDBM50191384((5R),(6E)-6-(5,6-dihydro-8H-imidazo[2,1-c][1,4]thi...)
Affinity DataIC50: >1.00E+4nM. Assay description: Inhibition of Enterobacter cloacae Imi1
In DepthDetails ArticlePubMed