BDBM50191510 2-[4-(4'-chloro-5-dimethylcarbamoylbiphenyl-2-ylmethoxy)-phenyl]-1-cyclohexyl-1H-benzimidazole-5-carboxylic acid::CHEMBL378218
SMILES CN(C)C(=O)c1ccc(COc2ccc(cc2)-c2nc3cc(ccc3n2C2CCCCC2)C(O)=O)c(c1)-c1ccc(Cl)cc1
InChI Key InChIKey=UXRKKYJFCINMEN-UHFFFAOYSA-N
Data  3 IC50
  Tab Delimited (TSV)   2D SDfile   Computed 3D by Vconf -m prep SDfile
Find this compound or compounds like it in BindingDB:
Activity Spreadsheet -- Enzyme Inhibition Constant Data from BindingDB
Found 3 hits for monomerid = 50191510
TargetRNA-directed RNA polymerase(Hepatitis C virus)
Central Pharmaceutical Research Institute
Curated by ChEMBL
LigandPNGBDBM50191510(2-[4-(4'-chloro-5-dimethylcarbamoylbiphenyl-2-ylme...)
Affinity DataIC50:  32nM. Assay description: Inhibition of HCV 1b BK six His-tagged C-terminal truncated 544 amino acid NS5B RNA dependent RNA polymerase
In DepthDetails ArticlePubMed
TargetRNA-directed RNA polymerase(Hepatitis C virus genotype 1)TBA
LigandPNGBDBM50191510(2-[4-(4'-chloro-5-dimethylcarbamoylbiphenyl-2-ylme...)
Affinity DataIC50:  3.12E+7nM. Assay description: Inhibition of Hepatitis C virus genotype 1 NS5B polymerases lacking C-terminal 47 amino acid residues expressed in Escherichia coli after 60 min
In DepthDetails Article
TargetRNA-directed RNA polymerase(Hepatitis C virus genotype 1)TBA
LigandPNGBDBM50191510(2-[4-(4'-chloro-5-dimethylcarbamoylbiphenyl-2-ylme...)
Affinity DataIC50:  3.13E+7nM. Assay description: Inhibition of Hepatitis C virus genotype 1 NS5B polymerases lacking C-terminal 47 amino acid residues expressed in Escherichia coli after 60 min
In DepthDetails Article