BDBM50192084 CHEMBL215095::cis-5-(4-fluorobenzyl)-N-benzyl-6-oxomorpholine-3-carboxamide
SMILES Fc1ccc(C[C@@H]2N[C@@H](COC2=O)C(=O)NCc2ccccc2)cc1
InChI Key InChIKey=DBEVZLWMFYHUHC-IRXDYDNUSA-N
Data  1 IC50
  Tab Delimited (TSV)   2D SDfile   Computed 3D by Vconf -m prep SDfile
Find this compound or compounds like it in BindingDB:
Activity Spreadsheet -- Enzyme Inhibition Constant Data from BindingDB
Found 1 hit for monomerid = 50192084
TargetVoltage-dependent T-type calcium channel subunit alpha-1G(Homo sapiens (Human))
Institute Of Science And Technology
Curated by ChEMBL
LigandPNGBDBM50192084(CHEMBL215095 | cis-5-(4-fluorobenzyl)-N-benzyl-6-o...)
Affinity DataIC50:  2.75E+3nM. Assay description: Ability to block calcium channel T type 3.1v expressed in HEK293 cells by whole cell patch clamp method
In DepthDetails ArticlePubMed