BDBM50192119 2-(2-(ethyl(4-(1,1,1,3,3,3-hexafluoro-2-hydroxypropan-2-yl)phenyl)amino)-2-phenylethoxy)-N-methylacetamide::CHEMBL385546
SMILES CCN(C(COCC(=O)NC)c1ccccc1)c1ccc(cc1)C(O)(C(F)(F)F)C(F)(F)F
InChI Key InChIKey=VYMLRIABXQHHAB-UHFFFAOYSA-N
Data  2 IC50  2 EC50
  Tab Delimited (TSV)   2D SDfile   Computed 3D by Vconf -m prep SDfile
Find this compound or compounds like it in BindingDB:
Activity Spreadsheet -- Enzyme Inhibition Constant Data from BindingDB
Found 4 hits for monomerid = 50192119
TargetOxysterols receptor LXR-beta(Homo sapiens (Human))
F. Hoffmann-La Roche
Curated by ChEMBL
LigandPNGBDBM50192119(2-(2-(ethyl(4-(1,1,1,3,3,3-hexafluoro-2-hydroxypro...)
Affinity DataIC50:  3.10E+4nM. Assay description: Binding affinity to LXRbeta by radioligand displacement assay
In DepthDetails ArticlePubMed
TargetOxysterols receptor LXR-alpha(Homo sapiens (Human))
F. Hoffmann-La Roche
Curated by ChEMBL
LigandPNGBDBM50192119(2-(2-(ethyl(4-(1,1,1,3,3,3-hexafluoro-2-hydroxypro...)
Affinity DataEC50: >4.00E+4nM. Assay description: Transactivation of LXRalpha by luciferase reporter gene assay
In DepthDetails ArticlePubMed
TargetOxysterols receptor LXR-beta(Homo sapiens (Human))
F. Hoffmann-La Roche
Curated by ChEMBL
LigandPNGBDBM50192119(2-(2-(ethyl(4-(1,1,1,3,3,3-hexafluoro-2-hydroxypro...)
Affinity DataEC50: >4.00E+4nM. Assay description: Transactivation of LXRbeta by luciferase reporter gene assay
In DepthDetails ArticlePubMed
TargetOxysterols receptor LXR-alpha(Homo sapiens (Human))
F. Hoffmann-La Roche
Curated by ChEMBL
LigandPNGBDBM50192119(2-(2-(ethyl(4-(1,1,1,3,3,3-hexafluoro-2-hydroxypro...)
Affinity DataIC50:  1.80E+4nM. Assay description: Binding affinity to LXRalpha by radioligand displacement assay
In DepthDetails ArticlePubMed