BDBM50193173 (S)-N-(4-methoxybenzyl)-2-(pyrrolidin-1-ylmethyl)pyrrolidine-1-carboxamide::CHEMBL218792
SMILES COc1ccc(CNC(=O)N2CCC[C@H]2CN2CCCC2)cc1
InChI Key InChIKey=GSRBKPRZDLXXJA-INIZCTEOSA-N
Data  1 KI
  Tab Delimited (TSV)   2D SDfile   Computed 3D by Vconf -m prep SDfile
Find this compound or compounds like it in BindingDB:
Activity Spreadsheet -- Enzyme Inhibition Constant Data from BindingDB
Found 1 hit for monomerid = 50193173
TargetHistamine H3 receptor(Homo sapiens (Human))
Novo Nordisk
Curated by ChEMBL
LigandPNGBDBM50193173((S)-N-(4-methoxybenzyl)-2-(pyrrolidin-1-ylmethyl)p...)
Affinity DataKi:  295nM. Assay description: Binding affinity at histamine H3 receptor by hH3-[35S]GTPgamma[S] binding assay
In DepthDetails ArticlePubMed