BDBM50193174 (S)-N-(4-(trifluoromethoxy)benzyl)-2-(pyrrolidin-1-ylmethyl)pyrrolidine-1-carboxamide::CHEMBL216669
SMILES FC(F)(F)Oc1ccc(CNC(=O)N2CCC[C@H]2CN2CCCC2)cc1
InChI Key InChIKey=XFTRPWJCEDWDHK-HNNXBMFYSA-N
Data  1 KI
  Tab Delimited (TSV)   2D SDfile   Computed 3D by Vconf -m prep SDfile
Find this compound or compounds like it in BindingDB:
Activity Spreadsheet -- Enzyme Inhibition Constant Data from BindingDB
Found 1 hit for monomerid = 50193174
TargetHistamine H3 receptor(Homo sapiens (Human))
Novo Nordisk
Curated by ChEMBL
LigandPNGBDBM50193174((S)-N-(4-(trifluoromethoxy)benzyl)-2-(pyrrolidin-1...)
Affinity DataKi:  121nM. Assay description: Binding affinity at histamine H3 receptor by hH3-[35S]GTPgamma[S] binding assay
In DepthDetails ArticlePubMed