BDBM50193181 CHEMBL219368::N-(2,3-dihydro-1H-inden-2-yl)-4-isopropylpiperazine-1-carboxamide
SMILES CC(C)N1CCN(CC1)C(=O)NC1Cc2ccccc2C1
InChI Key InChIKey=MQMATHONWKXUGC-UHFFFAOYSA-N
Data  1 KI
  Tab Delimited (TSV)   2D SDfile   Computed 3D by Vconf -m prep SDfile
Find this compound or compounds like it in BindingDB:
Activity Spreadsheet -- Enzyme Inhibition Constant Data from BindingDB
Found 1 hit for monomerid = 50193181
TargetHistamine H3 receptor(Homo sapiens (Human))
Novo Nordisk
Curated by ChEMBL
LigandPNGBDBM50193181(CHEMBL219368 | N-(2,3-dihydro-1H-inden-2-yl)-4-iso...)
Affinity DataKi:  30nM. Assay description: Binding affinity at histamine H3 receptor by hH3-[35S]GTPgamma[S] binding assay
In DepthDetails ArticlePubMed