BDBM50193190 (S)-2-pyrrolidin-1-ylmethyl-pyrrolidine-1-carboxylic acid (biphenyl-4-ylmethyl)-amide::CHEMBL218915
SMILES O=C(NCc1ccc(cc1)-c1ccccc1)N1CCC[C@H]1CN1CCCC1
InChI Key InChIKey=URCACYFHUSYVIV-QFIPXVFZSA-N
Data  1 KI
  Tab Delimited (TSV)   2D SDfile   Computed 3D by Vconf -m prep SDfile
Find this compound or compounds like it in BindingDB:
Activity Spreadsheet -- Enzyme Inhibition Constant Data from BindingDB
Found 1 hit for monomerid = 50193190
TargetHistamine H3 receptor(Homo sapiens (Human))
Novo Nordisk
Curated by ChEMBL
LigandPNGBDBM50193190((S)-2-pyrrolidin-1-ylmethyl-pyrrolidine-1-carboxyl...)
Affinity DataKi:  87nM. Assay description: Binding affinity at histamine H3 receptor by hH3-[35S]GTPgamma[S] binding assay
In DepthDetails ArticlePubMed