BDBM50193196 (S)-N-(4-phenoxybenzyl)-2-(pyrrolidin-1-ylmethyl)pyrrolidine-1-carboxamide::CHEMBL385201
SMILES O=C(NCc1ccc(Oc2ccccc2)cc1)N1CCC[C@H]1CN1CCCC1
InChI Key InChIKey=HINANNJLAJWXDV-FQEVSTJZSA-N
Data  1 KI
  Tab Delimited (TSV)   2D SDfile   Computed 3D by Vconf -m prep SDfile
Find this compound or compounds like it in BindingDB:
Activity Spreadsheet -- Enzyme Inhibition Constant Data from BindingDB
Found 1 hit for monomerid = 50193196
TargetHistamine H3 receptor(Homo sapiens (Human))
Novo Nordisk
Curated by ChEMBL
LigandPNGBDBM50193196((S)-N-(4-phenoxybenzyl)-2-(pyrrolidin-1-ylmethyl)p...)
Affinity DataKi:  34nM. Assay description: Binding affinity at histamine H3 receptor by hH3-[35S]GTPgamma[S] binding assay
In DepthDetails ArticlePubMed