BDBM50193693 CHEMBL215989::N-(2-(methyl(phenyl)amino)quinolin-6-yl)-3-(4-(trifluoromethyl)phenyl)propanamide
SMILES CN(c1ccccc1)c1ccc2cc(NC(=O)CCc3ccc(cc3)C(F)(F)F)ccc2n1
InChI Key InChIKey=JFMKHFLFCZVWIK-UHFFFAOYSA-N
Data  1 IC50
  Tab Delimited (TSV)   2D SDfile   Computed 3D by Vconf -m prep SDfile
Find this compound or compounds like it in BindingDB:
Activity Spreadsheet -- Enzyme Inhibition Constant Data from BindingDB
Found 1 hit for monomerid = 50193693
TargetMelanin-concentrating hormone receptor 1(Homo sapiens (Human))
Merck Research Laboratories
Curated by ChEMBL
LigandPNGBDBM50193693(CHEMBL215989 | N-(2-(methyl(phenyl)amino)quinolin-...)
Affinity DataIC50:  3.70E+3nM. Assay description: Displacement of 125I-[Phe13,Tyr19]-MCH from human MCH-R1
In DepthDetails ArticlePubMed