BDBM50194346 2-hydroxy-2-(5-nitro-6-(trifluoromethyl)-1H-indol-2-yl)propyl benzoate::CHEMBL218475
SMILES CC(O)(COC(=O)c1ccccc1)c1cc2cc(c(cc2[nH]1)C(F)(F)F)[N+]([O-])=O
InChI Key InChIKey=FOLWOILDBKOYKZ-UHFFFAOYSA-N
Data  1 IC50
  Tab Delimited (TSV)   2D SDfile   Computed 3D by Vconf -m prep SDfile
Find this compound or compounds like it in BindingDB:
Activity Spreadsheet -- Enzyme Inhibition Constant Data from BindingDB
Found 1 hit for monomerid = 50194346
TargetAndrogen receptor(Rattus norvegicus (Rat))
Johnson And Johnson Pharmaceutical Research And Development
Curated by ChEMBL
LigandPNGBDBM50194346(2-hydroxy-2-(5-nitro-6-(trifluoromethyl)-1H-indol-...)
Affinity DataIC50:  820nM. Assay description: Displacement of [3H]R1881 from rat androgen receptor
In DepthDetails ArticlePubMed