BDBM50194350 2-(5-chloro-6-(trifluoromethyl)-1H-indol-2-yl)-1-(2-chlorophenylthio)propan-2-ol::CHEMBL218399
SMILES CC(O)(CSc1ccccc1Cl)c1cc2cc(Cl)c(cc2[nH]1)C(F)(F)F
InChI Key InChIKey=SJCZTOXZMFFQNG-UHFFFAOYSA-N
Data  1 IC50
  Tab Delimited (TSV)   2D SDfile   Computed 3D by Vconf -m prep SDfile
Find this compound or compounds like it in BindingDB:
Activity Spreadsheet -- Enzyme Inhibition Constant Data from BindingDB
Found 1 hit for monomerid = 50194350
TargetAndrogen receptor(Rattus norvegicus (Rat))
Johnson And Johnson Pharmaceutical Research And Development
Curated by ChEMBL
LigandPNGBDBM50194350(2-(5-chloro-6-(trifluoromethyl)-1H-indol-2-yl)-1-(...)
Affinity DataIC50:  180nM. Assay description: Displacement of [3H]R1881 from rat androgen receptor
In DepthDetails ArticlePubMed