BDBM50195450 2-(4-((4,6-dioxo-2-thioxo-tetrahydropyrimidin-5(6H)-ylidene)methyl)phenoxy)acetamide::CHEMBL220169
SMILES [#7]-[#6](=O)-[#6]-[#8]-c1ccc(\[#6]=[#6]-2\[#6](=O)-[#7]-[#6](=S)-[#7]-[#6]-2=O)cc1
InChI Key InChIKey=LERBSTKHDLUSPN-UHFFFAOYSA-N
Data  1 Kd
  Tab Delimited (TSV)   2D SDfile   Computed 3D by Vconf -m prep SDfile
Find this compound or compounds like it in BindingDB:
Activity Spreadsheet -- Enzyme Inhibition Constant Data from BindingDB
Found 1 hit for monomerid = 50195450
TargetMitogen-activated protein kinase 1(Homo sapiens (Human))
University Of Maryland
Curated by ChEMBL
LigandPNGBDBM50195450(2-(4-((4,6-dioxo-2-thioxo-tetrahydropyrimidin-5(6H...)
Affinity DataKd:  2.00E+4nM. Assay description: Binding affinity to ERK2 by fluorescence quenching
In DepthDetails ArticlePubMed