BDBM50195742 CHEMBL227517::ethyl hydrogen 2-phenylethylphosphonate
SMILES CCOP(O)(=O)CCc1ccccc1
InChI Key InChIKey=GZUDEZNVOZREBO-UHFFFAOYSA-N
Data  1 IC50
  Tab Delimited (TSV)   2D SDfile   Computed 3D by Vconf -m prep SDfile
Find this compound or compounds like it in BindingDB:
Activity Spreadsheet -- Enzyme Inhibition Constant Data from BindingDB
Found 1 hit for monomerid = 50195742
TargetDiacylglycerol acyltransferase/mycolyltransferase Ag85C(Mycobacterium tuberculosis)
University Of Ljubljana
Curated by ChEMBL
LigandPNGBDBM50195742(CHEMBL227517 | ethyl hydrogen 2-phenylethylphospho...)
Affinity DataIC50:  2.25E+5nM. Assay description: Inhibition of Mycobacterium tuberculosis recombinant antigen 85C mycolyltransferase
In DepthDetails ArticlePubMed