BDBM50196039 CHEMBL3946282
SMILES [H][C@@]12CCCN1C(=O)[C@]1([H])CCCN1C(=O)[C@H](CC(C)C)NC(=O)[C@H](CCC(N)=O)NC(=O)[C@]1([H])CCCN1C(=O)[C@]1([H])CSCc3cc(CSC[C@H](NC2=O)C(=O)NCC(O)=O)cc(CSC[C@H](NC(=O)[C@H](C)N)C(=O)N[C@@H](Cc2c[nH]cn2)C(=O)N[C@@H](CO)C(=O)N[C@@H](CCCNC(N)=N)C(=O)N1)c3
InChI Key InChIKey=JOPCWTKNKMIHGG-UUMFMQISSA-N
Data  1 KI  1 IC50
PDB links: 1 PDB ID matches this monomer.
  Tab Delimited (TSV)   2D SDfile   Computed 3D by Vconf -m prep SDfile
Find this compound or compounds like it in BindingDB:
Activity Spreadsheet -- Enzyme Inhibition Constant Data from BindingDB
Found 2 hits for monomerid = 50196039
TargetSortase family protein(Staphylococcus aureus)
Ecole Polytechnique F�D�Rale De Lausanne
Curated by ChEMBL
LigandPNGBDBM50196039(CHEMBL3946282)
Affinity DataKi:  1.10E+3nM. Assay description: Inhibition of Staphylococcus aureus His6-biotinylated SrtA expressed in Escherichia coli XL1-blue using Dabcyl-LPETG-Edans as substrate assessed as r...
In DepthDetails ArticlePubMed
TargetSortase family protein(Staphylococcus aureus)
Ecole Polytechnique F�D�Rale De Lausanne
Curated by ChEMBL
LigandPNGBDBM50196039(CHEMBL3946282)
Affinity DataIC50:  1.67E+5nM. Assay description: Inhibition of SrtA-mediated incorporation of Fluo-GSLPETGGS substrate to cell wall of Staphylococcus aureus Newman after 24 hrs by fluorescence assay
In DepthDetails ArticlePubMed