BDBM50196049 CHEMBL3918395
SMILES [H][C@@]12CCCN1C(=O)[C@H](CSCc1cc3CSC[C@H](NC(=O)[C@H](CC(O)=O)NC(=O)[C@H](CC(C)C)NC(=O)[C@H](CO)NC(=O)[C@]([H])(CSCc(c1)c3)NC(=O)[C@]1([H])CCCN1C(=O)[C@]1([H])CCCN1C(=O)[C@H](CC(C)C)NC(=O)[C@H](CC(C)C)NC2=O)C(=O)NCC(O)=O)NC(=O)[C@H](C)N
InChI Key InChIKey=QSZFVPAFRQUNAD-VWFDEOOQSA-N
Data  1 KI
  Tab Delimited (TSV)   2D SDfile   Computed 3D by Vconf -m prep SDfile
Find this compound or compounds like it in BindingDB:
Activity Spreadsheet -- Enzyme Inhibition Constant Data from BindingDB
Found 1 hit for monomerid = 50196049
TargetSortase family protein(Staphylococcus aureus)
Ecole Polytechnique F�D�Rale De Lausanne
Curated by ChEMBL
LigandPNGBDBM50196049(CHEMBL3918395)
Affinity DataKi:  1.50E+3nM. Assay description: Inhibition of Staphylococcus aureus His6-biotinylated SrtA expressed in Escherichia coli XL1-blue using Dabcyl-LPETG-Edans as substrate assessed as r...
In DepthDetails ArticlePubMed