BDBM50196551 (2R,3R,4S,5R)-2-(6-(p-toluidino)-2-(4-(hydroxymethyl)-1H-pyrazol-1-yl)-9H-purin-9-yl)-5-(hydroxymethyl)-tetrahydrofuran-3,4-diol::CHEMBL400013
SMILES Cc1ccc(Nc2nc(nc3n(cnc23)[C@@H]2O[C@H](CO)[C@@H](O)[C@H]2O)-n2cc(CO)cn2)cc1
InChI Key InChIKey=FFXMREHKIUCCAM-WVSUBDOOSA-N
Data  4 KI
  Tab Delimited (TSV)   2D SDfile   Computed 3D by Vconf -m prep SDfile
Find this compound or compounds like it in BindingDB:
Activity Spreadsheet -- Enzyme Inhibition Constant Data from BindingDB
Found 4 hits for monomerid = 50196551
TargetAdenosine receptor A1(Homo sapiens (Human))
Cv Therapeutics
Curated by ChEMBL
LigandPNGBDBM50196551((2R,3R,4S,5R)-2-(6-(p-toluidino)-2-(4-(hydroxymeth...)
Affinity DataKi:  74nM. Assay description: Displacement of [3H]CPX from adenosine A1 receptor in DDT membranes
In DepthDetails ArticlePubMed
TargetAdenosine receptor A3(Homo sapiens (Human))
Cv Therapeutics
Curated by ChEMBL
LigandPNGBDBM50196551((2R,3R,4S,5R)-2-(6-(p-toluidino)-2-(4-(hydroxymeth...)
Affinity DataKi:  94nM. Assay description: Displacement of [125I]ABMECA from adenosine A3 receptor expressed in CHO cells
In DepthDetails ArticlePubMed
TargetAdenosine receptor A2a(Homo sapiens (Human))
Cv Therapeutics
Curated by ChEMBL
LigandPNGBDBM50196551((2R,3R,4S,5R)-2-(6-(p-toluidino)-2-(4-(hydroxymeth...)
Affinity DataKi:  2.32E+3nM. Assay description: Displacement of [3H]ZM241385 from A2A adenosine A2A receptor expressed in HEK cells
In DepthDetails ArticlePubMed
TargetAdenosine receptor A2b(Homo sapiens (Human))
Cv Therapeutics
Curated by ChEMBL
LigandPNGBDBM50196551((2R,3R,4S,5R)-2-(6-(p-toluidino)-2-(4-(hydroxymeth...)
Affinity DataKi: >6.00E+3nM. Assay description: Displacement of [3H]ZM241385 from adenosine A2B receptor expressed in HEK cells
In DepthDetails ArticlePubMed