BDBM50196560 (2R,3R,4S,5R)-2-(6-(bicyclo[2.2.1]heptan-1-ylamino)-2-(1H-pyrazol-1-yl)-9H-purin-9-yl)-5-(hydroxymethyl)-tetrahydrofuran-3,4-diol::CHEMBL399214
SMILES OC[C@H]1O[C@H]([C@H](O)[C@@H]1O)n1cnc2c(NC34CCC(CC3)C4)nc(nc12)-n1cccn1
InChI Key InChIKey=WIEQHMVCAWHWJC-HRXWTSITSA-N
Data  4 KI
  Tab Delimited (TSV)   2D SDfile   Computed 3D by Vconf -m prep SDfile
Find this compound or compounds like it in BindingDB:
Activity Spreadsheet -- Enzyme Inhibition Constant Data from BindingDB
Found 4 hits for monomerid = 50196560
TargetAdenosine receptor A1(Homo sapiens (Human))
Cv Therapeutics
Curated by ChEMBL
LigandPNGBDBM50196560((2R,3R,4S,5R)-2-(6-(bicyclo[2.2.1]heptan-1-ylamino...)
Affinity DataKi:  0.400nM. Assay description: Displacement of [3H]CPX from adenosine A1 receptor in DDT membranes
In DepthDetails ArticlePubMed
TargetAdenosine receptor A3(Homo sapiens (Human))
Cv Therapeutics
Curated by ChEMBL
LigandPNGBDBM50196560((2R,3R,4S,5R)-2-(6-(bicyclo[2.2.1]heptan-1-ylamino...)
Affinity DataKi:  1.27E+3nM. Assay description: Displacement of [125I]ABMECA from adenosine A3 receptor expressed in CHO cells
In DepthDetails ArticlePubMed
TargetAdenosine receptor A2a(Homo sapiens (Human))
Cv Therapeutics
Curated by ChEMBL
LigandPNGBDBM50196560((2R,3R,4S,5R)-2-(6-(bicyclo[2.2.1]heptan-1-ylamino...)
Affinity DataKi: >5.00E+3nM. Assay description: Displacement of [3H]ZM241385 from A2A adenosine A2A receptor expressed in HEK cells
In DepthDetails ArticlePubMed
TargetAdenosine receptor A2b(Homo sapiens (Human))
Cv Therapeutics
Curated by ChEMBL
LigandPNGBDBM50196560((2R,3R,4S,5R)-2-(6-(bicyclo[2.2.1]heptan-1-ylamino...)
Affinity DataKi: >6.00E+3nM. Assay description: Displacement of [3H]ZM241385 from adenosine A2B receptor expressed in HEK cells
In DepthDetails ArticlePubMed