BDBM50196566 CHEMBL234974::ethyl 1-(6-(bicyclo[2.2.1]heptan-1-ylamino)-9-((2R,3R,4S,5R)-3,4-dihydroxy-5-(hydroxymethyl)-tetrahydrofuran-2-yl)-9H-purin-2-yl)-1H-pyrazole-4-carboxylate
SMILES CCOC(=O)c1cnn(c1)-c1nc(NC23CCC(CC2)C3)c2ncn([C@@H]3O[C@H](CO)[C@@H](O)[C@H]3O)c2n1
InChI Key InChIKey=FVGBWQOWJZDNIS-VIUNQPMXSA-N
Data  4 KI
  Tab Delimited (TSV)   2D SDfile   Computed 3D by Vconf -m prep SDfile
Find this compound or compounds like it in BindingDB:
Activity Spreadsheet -- Enzyme Inhibition Constant Data from BindingDB
Found 4 hits for monomerid = 50196566
TargetAdenosine receptor A1(Homo sapiens (Human))
Cv Therapeutics
Curated by ChEMBL
LigandPNGBDBM50196566(CHEMBL234974 | ethyl 1-(6-(bicyclo[2.2.1]heptan-1-...)
Affinity DataKi:  3nM. Assay description: Displacement of [3H]CPX from adenosine A1 receptor in DDT membranes
In DepthDetails ArticlePubMed
TargetAdenosine receptor A3(Homo sapiens (Human))
Cv Therapeutics
Curated by ChEMBL
LigandPNGBDBM50196566(CHEMBL234974 | ethyl 1-(6-(bicyclo[2.2.1]heptan-1-...)
Affinity DataKi:  250nM. Assay description: Displacement of [125I]ABMECA from adenosine A3 receptor expressed in CHO cells
In DepthDetails ArticlePubMed
TargetAdenosine receptor A2a(Homo sapiens (Human))
Cv Therapeutics
Curated by ChEMBL
LigandPNGBDBM50196566(CHEMBL234974 | ethyl 1-(6-(bicyclo[2.2.1]heptan-1-...)
Affinity DataKi: >5.00E+3nM. Assay description: Displacement of [3H]ZM241385 from A2A adenosine A2A receptor expressed in HEK cells
In DepthDetails ArticlePubMed
TargetAdenosine receptor A2b(Homo sapiens (Human))
Cv Therapeutics
Curated by ChEMBL
LigandPNGBDBM50196566(CHEMBL234974 | ethyl 1-(6-(bicyclo[2.2.1]heptan-1-...)
Affinity DataKi: >6.00E+3nM. Assay description: Displacement of [3H]ZM241385 from adenosine A2B receptor expressed in HEK cells
In DepthDetails ArticlePubMed