BDBM50196927 CHEMBL3938810
SMILES Cc1ccccc1S(=O)(=O)NC([C@H](N)C(O)=O)C(O)=O
InChI Key InChIKey=COGJSNZLBJCRKR-IENPIDJESA-N
Data  6 IC50
  Tab Delimited (TSV)   2D SDfile   Computed 3D by Vconf -m prep SDfile
Find this compound or compounds like it in BindingDB:
Activity Spreadsheet -- Enzyme Inhibition Constant Data from BindingDB
Found 6 hits for monomerid = 50196927
TargetExcitatory amino acid transporter 2(Homo sapiens (Human))
University Of Copenhagen
Curated by ChEMBL
LigandPNGBDBM50196927(CHEMBL3938810)
Affinity DataIC50:  6.60E+3nM. Assay description: Inhibition of [3H]-D-Asp uptake at human EAAT2 expressed in HEK293 cells measured after 3 mins by TopCount method
In DepthDetails ArticlePubMed
TargetExcitatory amino acid transporter 2(Homo sapiens (Human))
University Of Copenhagen
Curated by ChEMBL
LigandPNGBDBM50196927(CHEMBL3938810)
Affinity DataIC50:  6.61E+3nM. Assay description: Inhibition of [3H]-D-Asp uptake at human EAAT2 expressed in HEK293 cells measured after 3 mins by TopCount method
In DepthDetails ArticlePubMed
TargetExcitatory amino acid transporter 1(Homo sapiens (Human))
University Of Copenhagen
Curated by ChEMBL
LigandPNGBDBM50196927(CHEMBL3938810)
Affinity DataIC50:  2.75E+3nM. Assay description: Inhibition of [3H]-D-Asp uptake at human EAAT1 expressed in HEK293 cells measured after 3 mins by TopCount method
In DepthDetails ArticlePubMed
TargetExcitatory amino acid transporter 3(Homo sapiens (Human))
University Of Copenhagen
Curated by ChEMBL
LigandPNGBDBM50196927(CHEMBL3938810)
Affinity DataIC50:  8.71E+3nM. Assay description: Inhibition of [3H]-D-Asp uptake at human EAAT3 expressed in HEK293 cells measured after 3 mins by TopCount method
In DepthDetails ArticlePubMed
TargetExcitatory amino acid transporter 3(Homo sapiens (Human))
University Of Copenhagen
Curated by ChEMBL
LigandPNGBDBM50196927(CHEMBL3938810)
Affinity DataIC50:  8.80E+3nM. Assay description: Inhibition of [3H]-D-Asp uptake at human EAAT3 expressed in HEK293 cells measured after 3 mins by TopCount method
In DepthDetails ArticlePubMed
TargetExcitatory amino acid transporter 1(Homo sapiens (Human))
University Of Copenhagen
Curated by ChEMBL
LigandPNGBDBM50196927(CHEMBL3938810)
Affinity DataIC50:  2.70E+3nM. Assay description: Inhibition of [3H]-D-Asp uptake at human EAAT1 expressed in HEK293 cells measured after 3 mins by TopCount method
In DepthDetails ArticlePubMed