BDBM50196999 CHEMBL413001::N-[4-(3,5-dioxo-hexyl)-phenyl]-3-{2-[2-(2-{2-[4-(2-{[2'-(isoxazol-5-ylsulfamoyl)-4-oxazol-2-yl-biphenyl-2-ylmethyl]-methyl-carbamoyl}-ethyl)-phenoxy]-ethoxy}-ethoxy)-ethoxy]-ethoxy}-propionamide
SMILES CN(Cc1cc(ccc1-c1ccccc1S(=O)(=O)Nc1ccno1)-c1ncco1)C(=O)CCc1ccc(OCCOCCOCCOCCOCCC(=O)Nc2ccc(CCC(=O)CC(C)=O)cc2)cc1
InChI Key InChIKey=YGFGPUBPCDIYGI-UHFFFAOYSA-N
Data  2 IC50
  Tab Delimited (TSV)   2D SDfile   Computed 3D by Vconf -m prep SDfile
Find this compound or compounds like it in BindingDB:
Activity Spreadsheet -- Enzyme Inhibition Constant Data from BindingDB
Found 2 hits for monomerid = 50196999
TargetEndothelin receptor type B(Homo sapiens (Human))
Covx Research
Curated by ChEMBL
LigandPNGBDBM50196999(CHEMBL413001 | N-[4-(3,5-dioxo-hexyl)-phenyl]-3-{2...)
Affinity DataIC50:  4.92E+3nM. Assay description: Displacement of [125I]ET1 from human ETB receptor expressed in CHO cells
In DepthDetails ArticlePubMed
TargetEndothelin-1 receptor(Homo sapiens (Human))
Covx Research
Curated by ChEMBL
LigandPNGBDBM50196999(CHEMBL413001 | N-[4-(3,5-dioxo-hexyl)-phenyl]-3-{2...)
Affinity DataIC50:  21.6nM. Assay description: Displacement of [125I]ET1 from human ETA receptor expressed in CHO cells
In DepthDetails ArticlePubMed