BDBM50197001 CHEMBL238539::N-[2'-(isoxazol-5-ylsulfamoyl)-4-oxazol-2-yl-biphenyl-2-ylmethyl]-3,3,N-trimethyl-butyramide
SMILES CN(Cc1cc(ccc1-c1ccccc1S(=O)(=O)Nc1ccno1)-c1ncco1)C(=O)CC(C)(C)C
InChI Key InChIKey=IDLNVQZPQPDNDW-UHFFFAOYSA-N
Data  2 IC50
  Tab Delimited (TSV)   2D SDfile   Computed 3D by Vconf -m prep SDfile
Find this compound or compounds like it in BindingDB:
Activity Spreadsheet -- Enzyme Inhibition Constant Data from BindingDB
Found 2 hits for monomerid = 50197001
TargetEndothelin receptor type B(Homo sapiens (Human))
Covx Research
Curated by ChEMBL
LigandPNGBDBM50197001(CHEMBL238539 | N-[2'-(isoxazol-5-ylsulfamoyl)-4-ox...)
Affinity DataIC50:  6.00E+3nM. Assay description: Displacement of [125I]ET1 from human ETB receptor expressed in CHO cells
In DepthDetails ArticlePubMed
TargetEndothelin-1 receptor(Homo sapiens (Human))
Covx Research
Curated by ChEMBL
LigandPNGBDBM50197001(CHEMBL238539 | N-[2'-(isoxazol-5-ylsulfamoyl)-4-ox...)
Affinity DataIC50:  1nM. Assay description: Displacement of [125I]ET1 from human ETA receptor expressed in CHO cells
In DepthDetails ArticlePubMed