BDBM50197727 CHEMBL3895839
SMILES CNS(=O)(=O)c1ccc(N(C)C)c(Nc2ncnc3[nH]cc(-c4ccco4)c23)c1
InChI Key InChIKey=POFMJJCZZYDTJE-UHFFFAOYSA-N
Data  1 IC50
  Tab Delimited (TSV)   2D SDfile   Computed 3D by Vconf -m prep SDfile
Find this compound or compounds like it in BindingDB:
Activity Spreadsheet -- Enzyme Inhibition Constant Data from BindingDB
Found 1 hit for monomerid = 50197727
TargetSerine/threonine-protein kinase TNNI3K(Homo sapiens (Human))
Glaxosmithkline
Curated by ChEMBL
LigandPNGBDBM50197727(CHEMBL3895839)
Affinity DataIC50: <10nM. Assay description: Displacement of 5-({[2-({[3-({4-[(5-hydroxy-2-methylphenyl)amino]-2-pyrimidinyl}amino)phenyl]carbonyl}amino)-ethyl]amino}carbonyl)-2-(6-hydroxy-3-oxo...
In DepthDetails ArticlePubMed