BDBM50198599 1-(3-(4-(4-methoxyphenyl)-2-methyl-1,2,3,4-tetrahydroisoquinolin-7-yloxy)propyl)piperidin-4-ol::CHEMBL394800
SMILES COc1ccc(cc1)C1CN(C)Cc2cc(OCCCN3CCC(O)CC3)ccc12
InChI Key InChIKey=CPILYYRWNUVSHU-UHFFFAOYSA-N
Data  3 KI
  Tab Delimited (TSV)   2D SDfile   Computed 3D by Vconf -m prep SDfile
Find this compound or compounds like it in BindingDB:
Activity Spreadsheet -- Enzyme Inhibition Constant Data from BindingDB
Found 3 hits for monomerid = 50198599
TargetSodium-dependent serotonin transporter(Rattus norvegicus (rat))
Johnson & Johnson Pharmaceutical Research And Development
Curated by ChEMBL
LigandPNGBDBM50198599(1-(3-(4-(4-methoxyphenyl)-2-methyl-1,2,3,4-tetrahy...)
Affinity DataKi:  1.40nM. Assay description: Binding affinity to rat SERT
In DepthDetails ArticlePubMed
TargetSodium-dependent serotonin transporter(Homo sapiens (Human))
Johnson & Johnson Pharmaceutical Research And Development
Curated by ChEMBL
LigandPNGBDBM50198599(1-(3-(4-(4-methoxyphenyl)-2-methyl-1,2,3,4-tetrahy...)
Affinity DataKi:  3.80nM. Assay description: Binding affinity to human SERT
In DepthDetails ArticlePubMed
TargetHistamine H3 receptor(Homo sapiens (Human))
Johnson & Johnson Pharmaceutical Research And Development
Curated by ChEMBL
LigandPNGBDBM50198599(1-(3-(4-(4-methoxyphenyl)-2-methyl-1,2,3,4-tetrahy...)
Affinity DataKi:  11nM. Assay description: Binding affinity to human histamine H3 receptor
In DepthDetails ArticlePubMed