BDBM50199379 (E/Z)-(8R,11R,14S)-8-(4-hydroxy-benzyl)-11-isopropyl-14-propyl-5,7,8,10,11,13,14,16,17,18-decahydro-6H-7,10,13,16-tetraaza-benzocyclooctadecene-9,12,15-trione::CHEMBL384698
SMILES CCC[C@@H]1NC(=O)[C@H](NC(=O)[C@@H](Cc2ccc(O)cc2)NCCc2ccccc2\C=C/CCNC1=O)C(C)C
InChI Key InChIKey=HPCVAFISJXNTEA-XVYFQXMKSA-N
Data  1 KI
  Tab Delimited (TSV)   2D SDfile   Computed 3D by Vconf -m prep SDfile
Find this compound or compounds like it in BindingDB:
Activity Spreadsheet -- Enzyme Inhibition Constant Data from BindingDB
Found 1 hit for monomerid = 50199379
TargetMotilin receptor(Homo sapiens (Human))
Tranzyme Pharma
Curated by ChEMBL
LigandPNGBDBM50199379((E/Z)-(8R,11R,14S)-8-(4-hydroxy-benzyl)-11-isoprop...)
Affinity DataKi: >1.00E+4nM. Assay description: Displacement of [125I]motilin from human MOTR
In DepthDetails ArticlePubMed