BDBM50199380 (9R,12R,15S)-12-isopropyl-9-phenyl-15-propyl-6,7,8,9,11,12,14,15,17,18,19,20-dodecahydro-5-oxa-8,11,14,17-tetraaza-benzocyclooctadecene-10,13,16-trione::CHEMBL214652
SMILES CCC[C@@H]1NC(=O)[C@H](NC(=O)[C@H](NCCOc2ccccc2CCCNC1=O)c1ccccc1)C(C)C
InChI Key InChIKey=VCDBXWUJNJYKOY-SKBVVQJISA-N
Data  1 KI
  Tab Delimited (TSV)   2D SDfile   Computed 3D by Vconf -m prep SDfile
Find this compound or compounds like it in BindingDB:
Activity Spreadsheet -- Enzyme Inhibition Constant Data from BindingDB
Found 1 hit for monomerid = 50199380
TargetMotilin receptor(Homo sapiens (Human))
Tranzyme Pharma
Curated by ChEMBL
LigandPNGBDBM50199380((9R,12R,15S)-12-isopropyl-9-phenyl-15-propyl-6,7,8...)
Affinity DataKi: >1.00E+4nM. Assay description: Displacement of [125I]motilin from human MOTR
In DepthDetails ArticlePubMed