BDBM50199994 (1R,4S)-4-amino-3-fluoro-cyclopent-2-ene carboxylic acid::CHEMBL385685
SMILES N[C@H]1C[C@H](C=C1F)C(O)=O
InChI Key InChIKey=HYFGNSPBWCIGEO-UCORVYFPSA-N
Data  1 KI
  Tab Delimited (TSV)   2D SDfile   Computed 3D by Vconf -m prep SDfile
Find this compound or compounds like it in BindingDB:
Activity Spreadsheet -- Enzyme Inhibition Constant Data from BindingDB
Found 1 hit for monomerid = 50199994
Target4-aminobutyrate aminotransferase, mitochondrial(Sus scrofa)
Northwestern University
Curated by ChEMBL
LigandPNGBDBM50199994((1R,4S)-4-amino-3-fluoro-cyclopent-2-ene carboxyli...)
Affinity DataKi:  1.30E+6nM. Assay description: Inhibition of pig brain GABA-AT in presence of beta-mercaptoethanol
In DepthDetails ArticlePubMed