BDBM50200300 CHEMBL3922939
SMILES [O-][N+](=O)c1cccc(CS(=O)(=O)N2CCCCC2C(=O)OCCCc2cccnc2)c1
InChI Key InChIKey=YFNFKRXELHVVFX-UHFFFAOYSA-N
Data  2 IC50
  Tab Delimited (TSV)   2D SDfile   Computed 3D by Vconf -m prep SDfile
Find this compound or compounds like it in BindingDB:
Activity Spreadsheet -- Enzyme Inhibition Constant Data from BindingDB
Found 2 hits for monomerid = 50200300
TargetOuter membrane protein MIP(Legionella pneumophila)
University Of W£Rzburg
Curated by ChEMBL
LigandPNGBDBM50200300(CHEMBL3922939)
Affinity DataIC50:  8.70E+3nM. Assay description: Inhibition of Mip PPIase activity in Legionella pneumophila
In DepthDetails ArticlePubMed
TargetOuter membrane protein MIP(Legionella pneumophila)
University Of W£Rzburg
Curated by ChEMBL
LigandPNGBDBM50200300(CHEMBL3922939)
Affinity DataIC50:  8.71E+3nM. Assay description: Inhibition of Mip PPIase activity in Legionella pneumophila
In DepthDetails ArticlePubMed