BDBM50200983 CHEMBL3981924::US10138212, Example 57
SMILES Nc1nc(C(=O)NCc2cccc(CO)n2)c2cccc(F)c2n1
InChI Key InChIKey=PPOKTFIYGXDKBM-UHFFFAOYSA-N
Data  2 KI
  Tab Delimited (TSV)   2D SDfile   Computed 3D by Vconf -m prep SDfile
Find this compound or compounds like it in BindingDB:
Activity Spreadsheet -- Enzyme Inhibition Constant Data from BindingDB
Found 2 hits for monomerid = 50200983
TargetAdenosine receptor A2a(Homo sapiens (Human))
Merck Sharp & Dohme
US Patent
LigandPNGBDBM50200983(CHEMBL3981924 | US10138212, Example 57)
Affinity DataKi:  9.60nM. Assay description: Binding affinities of compounds of the invention for the human A2a receptor were determined in a competition binding assay using Scintillation Proxim...
In DepthDetails US Patent
TargetAdenosine receptor A2a(Homo sapiens (Human))
Merck Sharp & Dohme
US Patent
LigandPNGBDBM50200983(CHEMBL3981924 | US10138212, Example 57)
Affinity DataKi:  9.60nM. Assay description: Displacement of [3H]5-amino-7-[2- phenethyl]-2-(furan-2-yl)-7H-pyrazolo[4,3-e][l,2,4]triazolo[l,5-c]pyrimidine from human adenosine A2A receptor expr...
In DepthDetails ArticlePubMed