BDBM50201192 CHEMBL3932681
SMILES [H][C@]12CS[C@@H](CCCCCc3cn(Cc4cccc(O)c4)nn3)[C@@]1([H])NC(=O)N2
InChI Key InChIKey=GIRKAZMAVNIIAF-BZSNNMDCSA-N
Data  1 KI
  Tab Delimited (TSV)   2D SDfile   Computed 3D by Vconf -m prep SDfile
Find this compound or compounds like it in BindingDB:
Activity Spreadsheet -- Enzyme Inhibition Constant Data from BindingDB
Found 1 hit for monomerid = 50201192
TargetBiotin--protein ligase(Homo sapiens (Human))
University Of Adelaide
Curated by ChEMBL
LigandPNGBDBM50201192(CHEMBL3932681)
Affinity DataKi: >1.60E+4nM. Assay description: Inhibition of human biotin protein ligase assessed as reduction in 3H-biotin incorporation into pyruvate carboxylase biotin domain after 10 mins by l...
In DepthDetails ArticlePubMed