BDBM50201792 CHEMBL3942776
SMILES CC(C)[C@H](NC(=O)[C@H](CCCNC(N)=N)NC(=O)N[C@@H](Cc1ccccc1)C(O)=O)C(=O)NC1=CN(CCC1)C(N)=N
InChI Key InChIKey=OEFDXGHEALUNEP-ACRUOGEOSA-N
Data  1 KI
  Tab Delimited (TSV)   2D SDfile   Computed 3D by Vconf -m prep SDfile
Find this compound or compounds like it in BindingDB:
Activity Spreadsheet -- Enzyme Inhibition Constant Data from BindingDB
Found 1 hit for monomerid = 50201792
TargetCathepsin K(Homo sapiens (Human))
University Of British Columbia
Curated by ChEMBL
LigandPNGBDBM50201792(CHEMBL3942776)
Affinity DataKi:  393nM. Assay description: Competitive inhibition of human recombinant cathepsin K using Z-FR-MCA fluorogenic substrate by Dixon plot analysis
In DepthDetails ArticlePubMed