BDBM50202482 CHEMBL3972685
SMILES CC(=O)OCOC(=O)N1CCN(CC1)c1ccc(Nc2ncc3c(C)c(C(C)=O)c(=O)n(C4CCCC4)c3n2)nc1
InChI Key InChIKey=AJTMZFRCOLMNQV-UHFFFAOYSA-N
Data  2 IC50
  Tab Delimited (TSV)   2D SDfile   Computed 3D by Vconf -m prep SDfile
Find this compound or compounds like it in BindingDB:
Activity Spreadsheet -- Enzyme Inhibition Constant Data from BindingDB
Found 2 hits for monomerid = 50202482
TargetCyclin-dependent kinase 4(Homo sapiens (Human))
China Pharmaceutical University
Curated by ChEMBL
LigandPNGBDBM50202482(CHEMBL3972685)
Affinity DataIC50:  32nM. Assay description: Inhibition of CDK4 (unknown origin) using histone H1 as substrate after 10 mins in presence of [gamma32P]ATP
In DepthDetails ArticlePubMed
TargetCyclin-dependent kinase 6(Homo sapiens (Human))
China Pharmaceutical University
Curated by ChEMBL
LigandPNGBDBM50202482(CHEMBL3972685)
Affinity DataIC50:  28nM. Assay description: Inhibition of CDK6 (unknown origin) using histone H1 as substrate after 10 mins in presence of [gamma32P]ATP
In DepthDetails ArticlePubMed