BDBM50202484 CHEMBL3986282
SMILES CC(=O)c1c(C)c2cnc(Nc3ccc(cn3)N3CCN(CC3)C(=O)CNCCN)nc2n(C2CCCC2)c1=O
InChI Key InChIKey=JFIULCBZFIWZRF-UHFFFAOYSA-N
Data  2 IC50
  Tab Delimited (TSV)   2D SDfile   Computed 3D by Vconf -m prep SDfile
Find this compound or compounds like it in BindingDB:
Activity Spreadsheet -- Enzyme Inhibition Constant Data from BindingDB
Found 2 hits for monomerid = 50202484
TargetCyclin-dependent kinase 4(Homo sapiens (Human))
China Pharmaceutical University
Curated by ChEMBL
LigandPNGBDBM50202484(CHEMBL3986282)
Affinity DataIC50:  19nM. Assay description: Inhibition of CDK4 (unknown origin) using histone H1 as substrate after 10 mins in presence of [gamma32P]ATP
In DepthDetails ArticlePubMed
TargetCyclin-dependent kinase 6(Homo sapiens (Human))
China Pharmaceutical University
Curated by ChEMBL
LigandPNGBDBM50202484(CHEMBL3986282)
Affinity DataIC50:  23nM. Assay description: Inhibition of CDK6 (unknown origin) using histone H1 as substrate after 10 mins in presence of [gamma32P]ATP
In DepthDetails ArticlePubMed