BDBM50202612 3-[4-(7-chloroquinolin-4-ylamino)-butyl]-2,3-dihydro-benzo[e][1,3]thiazin-4-one::CHEMBL219109
SMILES Clc1ccc2c(NCCCCN3CSc4ccccc4C3=O)ccnc2c1
InChI Key InChIKey=IHLYMQFMMKFDIV-UHFFFAOYSA-N
Data  1 IC50
  Tab Delimited (TSV)   2D SDfile   Computed 3D by Vconf -m prep SDfile
Find this compound or compounds like it in BindingDB:
Activity Spreadsheet -- Enzyme Inhibition Constant Data from BindingDB
Found 1 hit for monomerid = 50202612
TargetHistidine-rich protein PFHRP-II(Plasmodium falciparum)
Central Drug Research Institute
Curated by ChEMBL
LigandPNGBDBM50202612(3-[4-(7-chloroquinolin-4-ylamino)-butyl]-2,3-dihyd...)
Affinity DataIC50:  890nM. Assay description: Inhibition of beta-hematin polymerization
In DepthDetails ArticlePubMed