BDBM50203081 4-((4,5,6,7-tetrahydro-1H-indol-2-yl)methylene)-3-(1,2,3-thiadiazol-5-yl)-1H-pyrazol-5(4H)-one::CHEMBL399787
SMILES O=C1NN=C(\C1=C\c1cc2CCCCc2[nH]1)c1cnns1
InChI Key InChIKey=DKPKKVLRRXQGRH-POHAHGRESA-N
Data  1 IC50
  Tab Delimited (TSV)   2D SDfile   Computed 3D by Vconf -m prep SDfile
Find this compound or compounds like it in BindingDB:
Activity Spreadsheet -- Enzyme Inhibition Constant Data from BindingDB
Found 1 hit for monomerid = 50203081
TargetVascular endothelial growth factor receptor 2(Homo sapiens (Human))
Cephalon
Curated by ChEMBL
LigandPNGBDBM50203081(4-((4,5,6,7-tetrahydro-1H-indol-2-yl)methylene)-3-...)
Affinity DataIC50:  56nM. Assay description: Inhibition of human cytoplasmic VEGFR2 expressed in baculovirus after 15 mins by time resolved fluorescence assay
In DepthDetails ArticlePubMed