BDBM50203090 4-((4-bromo-1-methyl-1H-indol-3-yl)methylene)-3-(4-methyl-1,2,3-thiadiazol-5-yl)-1H-pyrazol-5(4H)-one::CHEMBL250853
SMILES Cn1cc(C=c2c(=O)[nH][nH]\c2=c2/snnc2=C)c2c(Br)cccc12
InChI Key InChIKey=MRAZNBZIRHNIHF-PKPNQYOGSA-N
Data  1 IC50
  Tab Delimited (TSV)   2D SDfile   Computed 3D by Vconf -m prep SDfile
Find this compound or compounds like it in BindingDB:
Activity Spreadsheet -- Enzyme Inhibition Constant Data from BindingDB
Found 1 hit for monomerid = 50203090
TargetVascular endothelial growth factor receptor 2(Homo sapiens (Human))
Cephalon
Curated by ChEMBL
LigandPNGBDBM50203090(4-((4-bromo-1-methyl-1H-indol-3-yl)methylene)-3-(4...)
Affinity DataIC50:  34nM. Assay description: Inhibition of human cytoplasmic VEGFR2 expressed in baculovirus after 15 mins by time resolved fluorescence assay
In DepthDetails ArticlePubMed