BDBM50203095 4-((4-bromo-5-methoxy-1-methyl-1H-indol-3-yl)methylene)-3-(1,2,3-thiadiazol-5-yl)-1H-pyrazol-5(4H)-one::CHEMBL398460
SMILES COc1ccc2n(C)cc(\C=C3/C(=O)NN=C3c3cnns3)c2c1Br
InChI Key InChIKey=YVJPQWFIQZMVQV-UITAMQMPSA-N
Data  1 IC50
  Tab Delimited (TSV)   2D SDfile   Computed 3D by Vconf -m prep SDfile
Find this compound or compounds like it in BindingDB:
Activity Spreadsheet -- Enzyme Inhibition Constant Data from BindingDB
Found 1 hit for monomerid = 50203095
TargetVascular endothelial growth factor receptor 2(Homo sapiens (Human))
Cephalon
Curated by ChEMBL
LigandPNGBDBM50203095(4-((4-bromo-5-methoxy-1-methyl-1H-indol-3-yl)methy...)
Affinity DataIC50:  6nM. Assay description: Inhibition of human cytoplasmic VEGFR2 expressed in baculovirus after 15 mins by time resolved fluorescence assay
In DepthDetails ArticlePubMed