BDBM50203100 CHEMBL249381::methyl 1-methyl-3-((5-oxo-3-(1,2,3-thiadiazol-5-yl)-1H-pyrazol-4(5H)-ylidene)methyl)-1H-indole-5-carboxylate
SMILES COC(=O)c1ccc2n(C)cc(\C=C3/C(=O)NN=C3c3cnns3)c2c1
InChI Key InChIKey=LKPKISSGUDOKQE-SDQBBNPISA-N
Data  1 IC50
  Tab Delimited (TSV)   2D SDfile   Computed 3D by Vconf -m prep SDfile
Find this compound or compounds like it in BindingDB:
Activity Spreadsheet -- Enzyme Inhibition Constant Data from BindingDB
Found 1 hit for monomerid = 50203100
TargetVascular endothelial growth factor receptor 2(Homo sapiens (Human))
Cephalon
Curated by ChEMBL
LigandPNGBDBM50203100(CHEMBL249381 | methyl 1-methyl-3-((5-oxo-3-(1,2,3-...)
Affinity DataIC50:  73nM. Assay description: Inhibition of human cytoplasmic VEGFR2 expressed in baculovirus after 15 mins by time resolved fluorescence assay
In DepthDetails ArticlePubMed