BDBM50203109 4-((4-bromo-5-methoxy-1-methyl-1H-indol-3-yl)methylene)-3-(4-methyl-1,2,3-thiadiazol-5-yl)-1H-pyrazol-5(4H)-one::CHEMBL400061
SMILES COc1ccc2n(C)cc(C=c3c(=O)[nH][nH]\c3=c3/snnc3=C)c2c1Br
InChI Key InChIKey=FUBWOXITIKWWQW-QGTCFMHYSA-N
Data  1 IC50
  Tab Delimited (TSV)   2D SDfile   Computed 3D by Vconf -m prep SDfile
Find this compound or compounds like it in BindingDB:
Activity Spreadsheet -- Enzyme Inhibition Constant Data from BindingDB
Found 1 hit for monomerid = 50203109
TargetVascular endothelial growth factor receptor 2(Homo sapiens (Human))
Cephalon
Curated by ChEMBL
LigandPNGBDBM50203109(4-((4-bromo-5-methoxy-1-methyl-1H-indol-3-yl)methy...)
Affinity DataIC50:  23nM. Assay description: Inhibition of human cytoplasmic VEGFR2 expressed in baculovirus after 15 mins by time resolved fluorescence assay
In DepthDetails ArticlePubMed