BDBM50203292 CHEMBL3902670
SMILES CC[C@H](C)[C@H](NC(=O)[C@H](CC1CCCCC1)NC(=O)c1cc(N)no1)C(=O)N1CCC2(CC1)C=Cc1ccccc21
InChI Key InChIKey=KFVCQVXIFKORCI-QLADTWODSA-N
Data  2 IC50
  Tab Delimited (TSV)   2D SDfile   Computed 3D by Vconf -m prep SDfile
Find this compound or compounds like it in BindingDB:
Activity Spreadsheet -- Enzyme Inhibition Constant Data from BindingDB
Found 2 hits for monomerid = 50203292
TargetProteinase-activated receptor 2(Homo sapiens (Human))
The University Of Queensland
Curated by ChEMBL
LigandPNGBDBM50203292(CHEMBL3902670)
Affinity DataIC50:  1.26E+3nM. Assay description: Antagonist activity at PAR2 in human HT-29 cells assessed as inhibition of 2f-LIGRLO-NH2-stimulated intracellular calcium release preincubated for 30...
In DepthDetails ArticlePubMed
TargetProteinase-activated receptor 2(Homo sapiens (Human))
The University Of Queensland
Curated by ChEMBL
LigandPNGBDBM50203292(CHEMBL3902670)
Affinity DataIC50:  1.20E+3nM. Assay description: Antagonist activity at PAR2 in human HT-29 cells assessed as inhibition of 2f-LIGRLO-NH2-stimulated intracellular calcium release preincubated for 30...
In DepthDetails ArticlePubMed