BDBM50203433 CHEMBL3906238
SMILES CCCCCS(=O)(=O)N[C@@H](C)[C@H](Oc1ccc2n(ncc2c1)-c1ccc(F)cc1)c1ccccc1
InChI Key InChIKey=JSDQGKGCJDOTRD-DCFHFQCYSA-N
Data  1 IC50
  Tab Delimited (TSV)   2D SDfile   Computed 3D by Vconf -m prep SDfile
Find this compound or compounds like it in BindingDB:
Activity Spreadsheet -- Enzyme Inhibition Constant Data from BindingDB
Found 1 hit for monomerid = 50203433
TargetGlucocorticoid receptor(Homo sapiens (Human))
Astrazeneca
Curated by ChEMBL
LigandPNGBDBM50203433(CHEMBL3906238)
Affinity DataIC50:  100nM. Assay description: Agonist activity at glucocorticoid receptor in human ChaGoK1 cells assessed as inhibition of AP1-mediated transcriptional activity by measuring reduc...
In DepthDetails ArticlePubMed