BDBM50204213 CHEMBL3924478
SMILES FC(F)(F)c1ccc(cc1)-c1cn2ccc[n+]2[n-]1
InChI Key InChIKey=KBSHSFWIXMZJKJ-UHFFFAOYSA-N
Data  1 IC50
  Tab Delimited (TSV)   2D SDfile   Computed 3D by Vconf -m prep SDfile
Find this compound or compounds like it in BindingDB:
Activity Spreadsheet -- Enzyme Inhibition Constant Data from BindingDB
Found 1 hit for monomerid = 50204213
TargetKinesin-like protein KIF11(Homo sapiens (Human))
University Of Shizuoka
Curated by ChEMBL
LigandPNGBDBM50204213(CHEMBL3924478)
Affinity DataIC50: >2.00E+4nM. Assay description: Inhibition of microtubule-stimulated kinesin spindle protein motor domain (unknown origin) ATPase activity preincubated for 20 mins followed by ATP a...
In DepthDetails ArticlePubMed