BDBM50204905 CHEMBL3984536
SMILES Cc1ccc(cc1)C1c2c(Oc3cc4CCCCc4c(N)c13)[nH]nc2-c1ccccc1
InChI Key InChIKey=GTSLBFWFRUIUIH-UHFFFAOYSA-N
Data  2 IC50
  Tab Delimited (TSV)   2D SDfile   Computed 3D by Vconf -m prep SDfile
Find this compound or compounds like it in BindingDB:
Activity Spreadsheet -- Enzyme Inhibition Constant Data from BindingDB
Found 2 hits for monomerid = 50204905
TargetCholinesterase(Homo sapiens (Human))
Tehran University Of Medical Sciences
Curated by ChEMBL
LigandPNGBDBM50204905(CHEMBL3984536)
Affinity DataIC50:  11nM. Assay description: Inhibition of human recombinant BChE using butyrylthiocholine iodide as substrate incubated for 5 mins followed by substrate addition measured for 1 ...
In DepthDetails ArticlePubMed
TargetAcetylcholinesterase(Electrophorus electricus (Electric eel))
Tehran University Of Medical Sciences
Curated by ChEMBL
LigandPNGBDBM50204905(CHEMBL3984536)
Affinity DataIC50:  98nM. Assay description: Inhibition of electric eel AChE using acetylthiocholine iodide as substrate incubated for 5 mins followed by substrate addition measured for 1 min by...
In DepthDetails ArticlePubMed