BDBM50205102 3-ethyl-4-((7R,7aS)-7-hydroxy-1,3-dioxo-tetrahydro-1H-pyrrolo[1,2-e]imidazol-2(3H)-yl)-2-(trifluoromethyl)benzonitrile::CHEMBL397217
SMILES CCc1c(ccc(C#N)c1C(F)(F)F)-n1c(O)c2[C@H](O)CCn2c1=O
InChI Key InChIKey=UUQFWGLWZSNKNL-LLVKDONJSA-N
Data  1 KI  1 EC50
  Tab Delimited (TSV)   2D SDfile   Computed 3D by Vconf -m prep SDfile
Find this compound or compounds like it in BindingDB:
Activity Spreadsheet -- Enzyme Inhibition Constant Data from BindingDB
Found 2 hits for monomerid = 50205102
TargetAndrogen receptor(Homo sapiens (Human))
Pharmaceutical Research Institute
Curated by ChEMBL
LigandPNGBDBM50205102(3-ethyl-4-((7R,7aS)-7-hydroxy-1,3-dioxo-tetrahydro...)
Affinity DataKi:  3.30nM. Assay description: Binding affinity to human AR
In DepthDetails ArticlePubMed
TargetAndrogen receptor(Homo sapiens (Human))
Pharmaceutical Research Institute
Curated by ChEMBL
LigandPNGBDBM50205102(3-ethyl-4-((7R,7aS)-7-hydroxy-1,3-dioxo-tetrahydro...)
Affinity DataEC50:  36nM. Assay description: Agonist activity at human AR
In DepthDetails ArticlePubMed