BDBM50205643 CHEMBL3956167
SMILES Fc1ccc(cc1)-c1nccc2c3ccccc3[nH]c12
InChI Key InChIKey=FDUMLUGGBLXNDO-UHFFFAOYSA-N
Data  1 IC50
  Tab Delimited (TSV)   2D SDfile   Computed 3D by Vconf -m prep SDfile
Find this compound or compounds like it in BindingDB:
Activity Spreadsheet -- Enzyme Inhibition Constant Data from BindingDB
Found 1 hit for monomerid = 50205643
TargetCholinesterase(Homo sapiens (Human))
University Of Massachusetts Boston
Curated by ChEMBL
LigandPNGBDBM50205643(CHEMBL3956167)
Affinity DataIC50:  4.27E+3nM. Assay description: Inhibition of BuChE (unknown origin) by spectrophotometric analysis based Ellman's assay
In DepthDetails ArticlePubMed